Loading...

freebsd-current@freebsd.org

[Prev] Thread [Next]  |  [Prev] Date [Next]

print/ghostscript9: ./base/sjpx_openjpeg.c:169: error: too many arguments to function O. Hartmann Mon Feb 13 04:00:19 2012

This arise today when updating  ghostscript9-9.04 to ghostscript9-9.05:


cc  -DHAVE_MKSTEMP   -DHAVE_FONTCONFIG -DHAVE_LIBIDN -DHAVE_SETLOCALE
-DHAVE_SSE2 -DHAVE_DBUS   -O2 -pipe -O2 -fno-strict-aliasing -pipe
-march=native -fPIC -DUPD_SIGNAL=0 -I.
-I/usr/ports/print/ghostscript9/work/ghostscript-9.05/lcms/include
-I/usr/local/include/libpng  -I/usr/local/include
-I/usr/local/include/freetype2  -Wall -Wstrict-prototypes -Wundef
-Wmissing-declarations -Wmissing-prototypes -Wwrite-strings
-Wno-strict-aliasing -Wdeclaration-after-statement -fno-builtin
-fno-common -DHAVE_STDINT_H=1 -DHAVE_SYS_TIME_H=1
-DGX_COLOR_INDEX_TYPE="unsigned long int" -O2 -pipe -O2
-fno-strict-aliasing -pipe -march=native -DUSE_LIBICONV_GNU
-DUSE_LIBPAPER -I/usr/local/include   -DGS_DEVS_SHARED
-DGS_DEVS_SHARED_DIR=\"/usr/local/lib/ghostscript/9.05\"
-Iopenjpeg/libopenjpeg/.. -Iopenjpeg/libopenjpeg -I./soobj -I./base
-DUSE_OPENJPEG_JP2 -ffast-math -DOPJ_STATIC -std=c99  -o
./soobj/sjpx_openjpeg.o \
        -c -DOPJ_STATIC ./base/sjpx_openjpeg.c
./base/sjpx_openjpeg.c: In function 'decode_image':
./base/sjpx_openjpeg.c:169: error: too many arguments to function
'opj_decode'
./base/sjpx_openjpeg.c:205: error: 'opj_image_comp_t' has no member
named 'typ'
./base/sjpx_openjpeg.c:205: error: 'CTYPE_COLOR' undeclared (first use
in this function)
./base/sjpx_openjpeg.c:205: error: (Each undeclared identifier is
reported only once
./base/sjpx_openjpeg.c:205: error: for each function it appears in.)
./base/sjpx_openjpeg.c:207: error: 'opj_image_comp_t' has no member
named 'typ'
./base/sjpx_openjpeg.c:207: error: 'CTYPE_OPACITY' undeclared (first use
in this function)
./base/sjpx_openjpeg.c:217: error: 'CLRSPC_CMYK' undeclared (first use
in this function)
./base/sjpx_openjpeg.c:250: error: 'opj_image_t' has no member named
'has_palette'
./base/sjpx_openjpeg.c:257: error: 'CLRSPC_EYCC' undeclared (first use
in this function)
gmake[2]: *** [soobj/sjpx_openjpeg.o] Error 1
gmake[2]: Leaving directory
`/usr/ports/print/ghostscript9/work/ghostscript-9.05'
gmake[1]: *** [so-subtarget] Error 2
gmake[1]: Leaving directory
`/usr/ports/print/ghostscript9/work/ghostscript-9.05'
gmake: *** [so] Error 2
*** Error code 1

Stop in /usr/ports/print/ghostscript9.
*** Error code 1

Stop in /usr/ports/print/ghostscript9.

===>>> make failed for print/ghostscript9
===>>> Aborting update

Terminated

===>>> You can restart from the point of failure with this command line:
       portmaster <flags> print/ghostscript9