Loading...

hivemind-dev@jakarta.apache.org

[Prev] Thread [Next]  |  [Prev] Date [Next]

[EMAIL PROTECTED]: Project jakarta-hivemind-library (in module jakarta-hivemind) failed hlship Wed Sep 07 03:54:22 2005

To whom it may engage...
        
This is an automated request, but not an unsolicited one. For 
more information please visit http://gump.apache.org/nagged.html, 
and/or contact the folk at [EMAIL PROTECTED]

Project jakarta-hivemind-library has an issue affecting its community 
integration.
This issue affects 2 projects.
The current state of this project is 'Failed', with reason 'Build Failed'.
For reference only, the following projects are affected by this:
    - jakarta-hivemind-library :  HiveMind is a services and configuration
    microkernel
    - jakarta-tapestry :  Component-based web application framework organized 
around i...


Full details are available at:
    
http://vmgump.apache.org/gump/public/jakarta-hivemind/jakarta-hivemind-library/index.html

That said, some information snippets are provided here.

The following annotations (debug/informational/warning/error messages) were 
provided:
 -DEBUG- Sole output [hivemind-lib-07092005.jar] identifier set to project name
 -INFO- Failed with reason build failed
 -DEBUG- Extracted fallback artifacts from Gump Repository



The following work was performed:
http://vmgump.apache.org/gump/public/jakarta-hivemind/jakarta-hivemind-library/gump_work/build_jakarta-hivemind_jakarta-hivemind-library.html
Work Name: build_jakarta-hivemind_jakarta-hivemind-library (Type: Build)
Work ended in a state of : Failed
Elapsed: 28 secs
Command Line: java -Djava.awt.headless=true -Dant.build.clonevm=true 
-Xbootclasspath/p:/usr/local/gump/public/workspace/xml-commons/java/external/build/xml-apis.jar:/usr/local/gump/public/workspace/xml-xerces2/java/build/xercesImpl.jar
 org.apache.tools.ant.Main -Dgump.merge=/x1/gump/public/gump/work/merge.xml 
-Dbuild.sysclasspath=only -Ddownload-warning-marker-displayed=true 
-Dtest.classes.dir=target/test-classes -Djunit-available=true 
-Dproject.version=07092005 -Djava.classes.dir=target/classes 
[Working Directory: /usr/local/gump/public/workspace/jakarta-hivemind/library]
CLASSPATH: 
/opt/jdk1.4/lib/tools.jar:/usr/local/gump/public/workspace/jakarta-hivemind/hivebuild/target/classes:/usr/local/gump/public/workspace/jakarta-hivemind/library/target/classes:/usr/local/gump/public/workspace/jakarta-hivemind/library/target/test-classes:/usr/local/gump/public/workspace/jakarta-hivemind/library/src/conf:/usr/local/gump/public/workspace/jakarta-hivemind/library/src/descriptor:/usr/local/gump/public/workspace/jakarta-hivemind/library/src/test:/usr/local/gump/public/workspace/ant/dist/lib/ant-jmf.jar:/usr/local/gump/public/workspace/ant/dist/lib/ant-swing.jar:/usr/local/gump/public/workspace/ant/dist/lib/ant-apache-resolver.jar:/usr/local/gump/public/workspace/ant/dist/lib/ant-trax.jar:/usr/local/gump/public/workspace/ant/dist/lib/ant-junit.jar:/usr/local/gump/public/workspace/ant/dist/lib/ant-launcher.jar:/usr/local/gump/public/workspace/ant/dist/lib/ant-nodeps.jar:/usr/local/gump/public/workspace/ant/dist/lib/ant.jar:/usr/local/gump/public/workspace/aopalliance/build/aopalliance.jar:/usr/local/gump/packages/asm-1.5.2/lib/asm-analysis-1.5.2.jar:/usr/local/gump/packages/asm-1.5.2/lib/asm-xml-1.5.2.jar:/usr/local/gump/packages/asm-1.5.2/lib/asm-attrs-1.5.2.jar:/usr/local/gump/packages/asm-1.5.2/lib/asm-1.5.2.jar:/usr/local/gump/packages/asm-1.5.2/lib/kasm-1.5.2.jar:/usr/local/gump/packages/asm-1.5.2/lib/asm-tree-1.5.2.jar:/usr/local/gump/packages/asm-1.5.2/lib/asm-util-1.5.2.jar:/usr/local/gump/public/workspace/jakarta-commons/logging/dist/commons-logging-07092005.jar:/usr/local/gump/public/workspace/jakarta-commons/logging/dist/commons-logging-api-07092005.jar:/usr/local/gump/packages/easymock1.1/easymock.jar:/usr/local/gump/packages/easymockclassextension1.1/easymockclassextension.jar:/usr/local/gump/packages/ejb-2_0-fr/ejb.jar:/usr/local/gump/packages/groovy-1.0-jsr-03/groovy-1.0-jsr-03.jar:/usr/local/gump/public/workspace/jakarta-hivemind/target/hivemind-07092005.jar:/usr/local/gump/public/workspace/jakarta-oro/jakarta-oro-07092005.jar:/usr/local/gump/public/workspace/javassist/javassist.jar:/usr/local/gump/public/workspace/dist/junit/junit.jar:/usr/local/gump/public/workspace/logging-log4j/log4j-07092005.jar:/usr/local/gump/packages/spring-framework-1.2.1/dist/spring-beans.jar:/usr/local/gump/packages/spring-framework-1.2.1/dist/spring-core.jar
---------------------------------------------
    [junit] Testsuite: org.apache.hivemind.lib.groovy.TestHiveMindBuilder
    [junit] Tests run: 2, Failures: 0, Errors: 2, Time elapsed: 0.044 sec

    [junit] Testcase: 
testBasicScript(org.apache.hivemind.lib.groovy.TestHiveMindBuilder):      
Caused an ERROR
    [junit] null
    [junit] java.lang.NoClassDefFoundError
    [junit]     at 
groovy.lang.GroovyObjectSupport.<init>(GroovyObjectSupport.java:61)
    [junit]     at groovy.lang.Binding.<init>(Binding.java:62)
    [junit]     at groovy.lang.GroovyShell.<init>(GroovyShell.java:125)
    [junit]     at 
org.apache.hivemind.lib.groovy.TestHiveMindBuilder.testBasicScript(TestHiveMindBuilder.java:55)


    [junit] Testcase: 
testLinePreciseErrorReporting(org.apache.hivemind.lib.groovy.TestHiveMindBuilder):
        Caused an ERROR
    [junit] null
    [junit] java.lang.NoClassDefFoundError
    [junit]     at 
groovy.lang.GroovyObjectSupport.<init>(GroovyObjectSupport.java:61)
    [junit]     at groovy.lang.Binding.<init>(Binding.java:62)
    [junit]     at groovy.lang.GroovyShell.<init>(GroovyShell.java:125)
    [junit]     at 
org.apache.hivemind.lib.groovy.TestHiveMindBuilder.testLinePreciseErrorReporting(TestHiveMindBuilder.java:71)


    [junit] TEST org.apache.hivemind.lib.groovy.TestHiveMindBuilder FAILED
    [junit] Testsuite: org.apache.hivemind.lib.impl.TestMethodInterceptorFactory
    [junit] Tests run: 4, Failures: 0, Errors: 0, Time elapsed: 1.316 sec

    [junit] Testsuite: org.apache.hivemind.lib.impl.TestServicePropertyFactory
    [junit] Tests run: 6, Failures: 0, Errors: 0, Time elapsed: 0.665 sec

    [junit] Testsuite: org.apache.hivemind.lib.pipeline.TestBridgeBuilder
    [junit] Tests run: 5, Failures: 0, Errors: 0, Time elapsed: 0.055 sec

    [junit] Testsuite: org.apache.hivemind.lib.pipeline.TestFilterMethodAnalyzer
    [junit] Tests run: 5, Failures: 0, Errors: 0, Time elapsed: 0.013 sec

    [junit] Testsuite: org.apache.hivemind.lib.pipeline.TestPipelineAssembler
    [junit] Tests run: 9, Failures: 0, Errors: 0, Time elapsed: 0.682 sec

    [junit] Testsuite: org.apache.hivemind.lib.strategy.TestStrategyFactory
    [junit] Tests run: 5, Failures: 0, Errors: 0, Time elapsed: 0.37 sec

    [junit] Testsuite: org.apache.hivemind.lib.util.TestStrategyRegistry
    [junit] Tests run: 14, Failures: 0, Errors: 0, Time elapsed: 0.021 sec

    [junit] Tests FAILED

BUILD FAILED
/x1/gump/public/workspace/jakarta-hivemind/hivebuild/module.xml:237: The 
following error occurred while executing this line:
/x1/gump/public/workspace/jakarta-hivemind/hivebuild/module.xml:212: Some tests 
failed.

Total time: 28 seconds
---------------------------------------------

To subscribe to this information via syndicated feeds:
- RSS: 
http://vmgump.apache.org/gump/public/jakarta-hivemind/jakarta-hivemind-library/rss.xml
- Atom: 
http://vmgump.apache.org/gump/public/jakarta-hivemind/jakarta-hivemind-library/atom.xml

============================== Gump Tracking Only ===
Produced by Gump version 2.2.
Gump Run 20000007092005, vmgump.apache.org:vmgump-public:20000007092005
Gump E-mail Identifier (unique within run) #21.

--
Apache Gump
http://gump.apache.org/ [Instance: vmgump]

---------------------------------------------------------------------
To unsubscribe, e-mail: [EMAIL PROTECTED]
For additional commands, e-mail: [EMAIL PROTECTED]