Loading...

turbine-dev@jakarta.apache.org

[Prev] Thread [Next]  |  [Prev] Date [Next]

[EMAIL PROTECTED]: Project fulcrum-cache (in module jakarta-turbine-fulcrum) failed fulcrum-cache development Sat Sep 16 11:13:01 2006

To whom it may engage...
        
This is an automated request, but not an unsolicited one. For 
more information please visit http://gump.apache.org/nagged.html, 
and/or contact the folk at [EMAIL PROTECTED]

Project fulcrum-cache has an issue affecting its community integration.
This issue affects 3 projects,
 and has been outstanding for 17 runs.
The current state of this project is 'Failed', with reason 'Build Failed'.
For reference only, the following projects are affected by this:
    - fulcrum-cache :  Services Framework
    - jakarta-turbine-2 :  A servlet based framework.
    - portals-jetspeed-1 :  Enterprise Information Portal


Full details are available at:
    
http://vmgump.apache.org/gump/public/jakarta-turbine-fulcrum/fulcrum-cache/index.html

That said, some information snippets are provided here.

The following annotations (debug/informational/warning/error messages) were 
provided:
 -DEBUG- Sole output [fulcrum-cache-15092006.jar] identifier set to project name
 -DEBUG- Dependency on excalibur-framework-api exists, no need to add for 
property maven.jar.avalon-framework-api.
 -DEBUG- Dependency on excalibur-framework-impl exists, no need to add for 
property maven.jar.avalon-framework-impl.
 -DEBUG- (Gump generated) Maven Properties in: 
/usr/local/gump/public/workspace/jakarta-turbine-fulcrum/cache/build.properties
 -INFO- Failed with reason build failed
 -DEBUG- Maven POM in: 
/usr/local/gump/public/workspace/jakarta-turbine-fulcrum/cache/project.xml
 -DEBUG- Maven project properties in: 
/usr/local/gump/public/workspace/jakarta-turbine-fulcrum/cache/project.properties
 -INFO- Failed to extract fallback artifacts from Gump Repository



The following work was performed:
http://vmgump.apache.org/gump/public/jakarta-turbine-fulcrum/fulcrum-cache/gump_work/build_jakarta-turbine-fulcrum_fulcrum-cache.html
Work Name: build_jakarta-turbine-fulcrum_fulcrum-cache (Type: Build)
Work ended in a state of : Failed
Elapsed: 48 secs
Command Line: maven --offline jar 
[Working Directory: 
/usr/local/gump/public/workspace/jakarta-turbine-fulcrum/cache]
CLASSPATH: 
/opt/jdk1.5/lib/tools.jar:/usr/local/gump/public/workspace/jakarta-turbine-fulcrum/cache/target/classes:/usr/local/gump/public/workspace/ant/dist/lib/ant-jmf.jar:/usr/local/gump/public/workspace/ant/dist/lib/ant-swing.jar:/usr/local/gump/public/workspace/ant/dist/lib/ant-apache-resolver.jar:/usr/local/gump/public/workspace/ant/dist/lib/ant-trax.jar:/usr/local/gump/public/workspace/ant/dist/lib/ant-junit.jar:/usr/local/gump/public/workspace/ant/dist/lib/ant-launcher.jar:/usr/local/gump/public/workspace/ant/dist/lib/ant-nodeps.jar:/usr/local/gump/public/workspace/ant/dist/lib/ant.jar:/usr/local/gump/packages/ehcache-1.0/ehcache-1.0.jar:/usr/local/gump/packages/dougLea/concurrent.jar:/usr/local/gump/public/workspace/excalibur/framework/api/target/excalibur-framework-api-15092006.jar:/usr/local/gump/public/workspace/excalibur/framework/impl/target/excalibur-framework-impl-15092006.jar:/usr/local/gump/public/workspace/jakarta-turbine-fulcrum/yaafi/target/fulcrum-yaafi-15092006.jar:/usr/local/gump/public/workspace/jakarta-turbine-fulcrum/testcontainer/target/fulcrum-testcontainer-15092006.jar:/usr/local/gump/public/workspace/jakarta-commons/logging/target/commons-logging-15092006.jar:/usr/local/gump/public/workspace/jakarta-commons/logging/target/commons-logging-api-15092006.jar:/usr/local/gump/public/workspace/jakarta-commons/lang/dist/commons-lang-15092006.jar:/usr/local/gump/public/workspace/jakarta-turbine-jcs/target/jcs-15092006.jar
---------------------------------------------
    [junit] Could not initialize the container
    [junit] java.lang.RuntimeException: Could not initialize the container
    [junit]     at 
org.apache.fulcrum.testcontainer.YAAFIContainer.startup(YAAFIContainer.java:90)
    [junit]     at 
org.apache.fulcrum.testcontainer.BaseUnitTest.lookup(BaseUnitTest.java:134)
    [junit]     at 
org.apache.fulcrum.cache.JCSCacheTest.setUp(JCSCacheTest.java:60)
    [junit] 
    [junit] 
    [junit] Testcase: 
testRefreshableTimeToLive(org.apache.fulcrum.cache.JCSCacheTest): Caused an 
ERROR
    [junit] Could not initialize the container
    [junit] java.lang.RuntimeException: Could not initialize the container
    [junit]     at 
org.apache.fulcrum.testcontainer.YAAFIContainer.startup(YAAFIContainer.java:90)
    [junit]     at 
org.apache.fulcrum.testcontainer.BaseUnitTest.lookup(BaseUnitTest.java:134)
    [junit]     at 
org.apache.fulcrum.cache.JCSCacheTest.setUp(JCSCacheTest.java:60)
    [junit] 
    [junit] 
    [junit] Testcase: 
testCacheGetKeyList(org.apache.fulcrum.cache.JCSCacheTest):       Caused an 
ERROR
    [junit] Could not initialize the container
    [junit] java.lang.RuntimeException: Could not initialize the container
    [junit]     at 
org.apache.fulcrum.testcontainer.YAAFIContainer.startup(YAAFIContainer.java:90)
    [junit]     at 
org.apache.fulcrum.testcontainer.BaseUnitTest.lookup(BaseUnitTest.java:134)
    [junit]     at 
org.apache.fulcrum.cache.JCSCacheTest.setUp(JCSCacheTest.java:60)
    [junit] 
    [junit] 
    [junit] Testcase: 
testCacheGetCachedObjects(org.apache.fulcrum.cache.JCSCacheTest): Caused an 
ERROR
    [junit] Could not initialize the container
    [junit] java.lang.RuntimeException: Could not initialize the container
    [junit]     at 
org.apache.fulcrum.testcontainer.YAAFIContainer.startup(YAAFIContainer.java:90)
    [junit]     at 
org.apache.fulcrum.testcontainer.BaseUnitTest.lookup(BaseUnitTest.java:134)
    [junit]     at 
org.apache.fulcrum.cache.JCSCacheTest.setUp(JCSCacheTest.java:60)
    [junit] 
    [junit] 
    [junit] Testcase: 
testCacheModification(org.apache.fulcrum.cache.JCSCacheTest):     Caused an 
ERROR
    [junit] Could not initialize the container
    [junit] java.lang.RuntimeException: Could not initialize the container
    [junit]     at 
org.apache.fulcrum.testcontainer.YAAFIContainer.startup(YAAFIContainer.java:90)
    [junit]     at 
org.apache.fulcrum.testcontainer.BaseUnitTest.lookup(BaseUnitTest.java:134)
    [junit]     at 
org.apache.fulcrum.cache.JCSCacheTest.setUp(JCSCacheTest.java:60)
    [junit] 
    [junit] 
    [junit] [ERROR] TEST org.apache.fulcrum.cache.JCSCacheTest FAILED

BUILD FAILED
File...... /home/gump/.maven/cache/maven-test-plugin-1.6.2/plugin.jelly
Element... fail
Line...... 181
Column.... 54
There were test failures.
Total time: 47 seconds
Finished at: Fri Sep 15 06:04:38 PDT 2006

---------------------------------------------

To subscribe to this information via syndicated feeds:
- RSS: 
http://vmgump.apache.org/gump/public/jakarta-turbine-fulcrum/fulcrum-cache/rss.xml
- Atom: 
http://vmgump.apache.org/gump/public/jakarta-turbine-fulcrum/fulcrum-cache/atom.xml

============================== Gump Tracking Only ===
Produced by Gump version 2.2.
Gump Run 21000015092006, vmgump.apache.org:vmgump-public:21000015092006
Gump E-mail Identifier (unique within run) #50.

--
Apache Gump
http://gump.apache.org/ [Instance: vmgump]

---------------------------------------------------------------------
To unsubscribe, e-mail: [EMAIL PROTECTED]
For additional commands, e-mail: [EMAIL PROTECTED]